Quantcast

[Nanocubes-discuss] cannot build on ubuntu 12.04

classic Classic list List threaded Threaded
7 messages Options
Reply | Threaded
Open this post in threaded view
|  
Report Content as Inappropriate

[Nanocubes-discuss] cannot build on ubuntu 12.04

Song Li
Hi there,

I am trying to build nanocube but got stuck, here're the details:

System configuration:
OS:  Ubuntu 64bit

uname -a 
Linux song-VirtualBox 3.8.0-29-generic #42~precise1-Ubuntu SMP Wed Aug 14 16:19:23 UTC 2013 x86_64 x86_64 x86_64 GNU/Linux

Tool chain:

GCC: gcc version 4.7.3 (Ubuntu/Linaro 4.7.3-2ubuntu1~12.04) 
G++: g++-4.7

I followed the steps in:


and was able to get to make, no errors during config, however I got the following errors:

In file included from /usr/include/boost/thread/pthread/condition_variable.hpp:10:0,
                 from /usr/include/boost/thread/condition_variable.hpp:16,
                 from /usr/include/boost/thread/pthread/shared_mutex.hpp:13,
                 from /usr/include/boost/thread/shared_mutex.hpp:16,
                 from nc.cc:25:
/usr/include/boost/thread/pthread/thread_data.hpp: In constructor ‘boost::detail::tss_data_node::tss_data_node(boost::shared_ptr<boost::detail::tss_cleanup_function>, void*)’:
/usr/include/boost/thread/pthread/thread_data.hpp:36:41: error: use of deleted function ‘boost::shared_ptr<boost::detail::tss_cleanup_function>::shared_ptr(const boost::shared_ptr<boost::detail::tss_cleanup_function>&)’
In file included from /usr/include/boost/shared_ptr.hpp:17:0,
                 from /usr/include/boost/spirit/home/qi/string/symbols.hpp:30,
                 from /usr/include/boost/spirit/home/qi/string.hpp:15,
                 from /usr/include/boost/spirit/home/qi.hpp:27,
                 from /usr/include/boost/spirit/include/qi.hpp:16,
                 from ./QueryParser.hh:11,
                 from nc.cc:13:
/usr/include/boost/smart_ptr/shared_ptr.hpp:168:25: note: ‘boost::shared_ptr<boost::detail::tss_cleanup_function>::shared_ptr(const boost::shared_ptr<boost::detail::tss_cleanup_function>&)’ is implicitly declared as deleted because ‘boost::shared_ptr<boost::detail::tss_cleanup_function>’ declares a move constructor or move assignment operator
make[2]: *** [nc_q20_q20_u2_u4-nc.o] Error 1


--
Best Regards,

Song

This message (including any attachments) contains confidential information intended for a specific individual and purpose, and is protected by law.  If you are not the intended recipient, you should delete this message.  Any disclosure, copying, or distribution of this message, or the taking of any action based on it, is strictly prohibited.
Reply | Threaded
Open this post in threaded view
|  
Report Content as Inappropriate

Re: [Nanocubes-discuss] cannot build on ubuntu 12.04

laurolins
Hi Song,
Maybe this problem can be solved by using a newer version of boost. What boost version you have?
Thanks,
Lauro

On Jan 8, 2014, at 5:28 PM, Song Li <[hidden email]> wrote:

Hi there,

I am trying to build nanocube but got stuck, here're the details:

System configuration:
OS:  Ubuntu 64bit

uname -a 
Linux song-VirtualBox 3.8.0-29-generic #42~precise1-Ubuntu SMP Wed Aug 14 16:19:23 UTC 2013 x86_64 x86_64 x86_64 GNU/Linux

Tool chain:

GCC: gcc version 4.7.3 (Ubuntu/Linaro 4.7.3-2ubuntu1~12.04) 
G++: g++-4.7

I followed the steps in:


and was able to get to make, no errors during config, however I got the following errors:

In file included from /usr/include/boost/thread/pthread/condition_variable.hpp:10:0,
                 from /usr/include/boost/thread/condition_variable.hpp:16,
                 from /usr/include/boost/thread/pthread/shared_mutex.hpp:13,
                 from /usr/include/boost/thread/shared_mutex.hpp:16,
                 from nc.cc:25:
/usr/include/boost/thread/pthread/thread_data.hpp: In constructor ‘boost::detail::tss_data_node::tss_data_node(boost::shared_ptr<boost::detail::tss_cleanup_function>, void*)’:
/usr/include/boost/thread/pthread/thread_data.hpp:36:41: error: use of deleted function ‘boost::shared_ptr<boost::detail::tss_cleanup_function>::shared_ptr(const boost::shared_ptr<boost::detail::tss_cleanup_function>&)’
In file included from /usr/include/boost/shared_ptr.hpp:17:0,
                 from /usr/include/boost/spirit/home/qi/string/symbols.hpp:30,
                 from /usr/include/boost/spirit/home/qi/string.hpp:15,
                 from /usr/include/boost/spirit/home/qi.hpp:27,
                 from /usr/include/boost/spirit/include/qi.hpp:16,
                 from ./QueryParser.hh:11,
                 from nc.cc:13:
/usr/include/boost/smart_ptr/shared_ptr.hpp:168:25: note: ‘boost::shared_ptr<boost::detail::tss_cleanup_function>::shared_ptr(const boost::shared_ptr<boost::detail::tss_cleanup_function>&)’ is implicitly declared as deleted because ‘boost::shared_ptr<boost::detail::tss_cleanup_function>’ declares a move constructor or move assignment operator
make[2]: *** [nc_q20_q20_u2_u4-nc.o] Error 1


--
Best Regards,

Song

This message (including any attachments) contains confidential information intended for a specific individual and purpose, and is protected by law.  If you are not the intended recipient, you should delete this message.  Any disclosure, copying, or distribution of this message, or the taking of any action based on it, is strictly prohibited.
_______________________________________________
Nanocubes-discuss mailing list
[hidden email]
http://mailman.nanocubes.net/mailman/listinfo/nanocubes-discuss_mailman.nanocubes.net

Reply | Threaded
Open this post in threaded view
|  
Report Content as Inappropriate

Re: [Nanocubes-discuss] cannot build on ubuntu 12.04

Stephen Frowe Ingram

Seconded.  I had this same error which was fixed by updating to the latest
boost.

I used the boost install from the website and not the one from 'apt-get'.

-Stephen

On Wed, 8 Jan 2014, Lauro Lins wrote:

> Hi Song,Maybe this problem can be solved by using a newer version of boost. What boost version you have?
> Thanks,
> Lauro
>
> On Jan 8, 2014, at 5:28 PM, Song Li <[hidden email]> wrote:
>
>       Hi there,
> I am trying to build nanocube but got stuck, here're the details:
>
> System configuration:
> OS:  Ubuntu 64bit
>
> uname -a  Linux song-VirtualBox 3.8.0-29-generic #42~precise1-Ubuntu SMP Wed Aug 14 16:19:23 UTC 2013 x86_64 x86_64 x86_64 GNU/Linux
>
> Tool chain:
>
> GCC: gcc version 4.7.3 (Ubuntu/Linaro 4.7.3-2ubuntu1~12.04) 
> G++: g++-4.7
>
> I followed the steps in:
>
> https://github.com/laurolins/nanocube/blob/master/README.md
>
> and was able to get to make, no errors during config, however I got the following errors:
>
> In file included from /usr/include/boost/thread/pthread/condition_variable.hpp:10:0,
>                  from /usr/include/boost/thread/condition_variable.hpp:16,
>                  from /usr/include/boost/thread/pthread/shared_mutex.hpp:13,
>                  from /usr/include/boost/thread/shared_mutex.hpp:16,
>                  from nc.cc:25:
> /usr/include/boost/thread/pthread/thread_data.hpp: In constructor ‘boost::detail::tss_data_node::tss_data_node(boost::shared_ptr<boost::detail::tss_cleanup_function>, void*)’:
> /usr/include/boost/thread/pthread/thread_data.hpp:36:41: error: use of deleted function ‘boost::shared_ptr<boost::detail::tss_cleanup_function>::shared_ptr(const boost::shared_ptr<boost::detail::tss_cleanup_function>&)’
> In file included from /usr/include/boost/shared_ptr.hpp:17:0,
>                  from /usr/include/boost/spirit/home/qi/string/symbols.hpp:30,
>                  from /usr/include/boost/spirit/home/qi/string.hpp:15,
>                  from /usr/include/boost/spirit/home/qi.hpp:27,
>                  from /usr/include/boost/spirit/include/qi.hpp:16,
>                  from ./QueryParser.hh:11,
>                  from nc.cc:13:
> /usr/include/boost/smart_ptr/shared_ptr.hpp:168:25: note: ‘boost::shared_ptr<boost::detail::tss_cleanup_function>::shared_ptr(const boost::shared_ptr<boost::detail::tss_cleanup_function>&)’ is implicitly declared as deleted because
> ‘boost::shared_ptr<boost::detail::tss_cleanup_function>’ declares a move constructor or move assignment operator
> make[2]: *** [nc_q20_q20_u2_u4-nc.o] Error 1
>
>
> --
> Best Regards,
>
> Song
>
> This message (including any attachments) contains confidential information intended for a specific individual and purpose, and is protected by law.  If you are not the intended recipient, you should delete this message.  Any disclosure, copying, or
> distribution of this message, or the taking of any action based on it, is strictly prohibited.
> _______________________________________________
> Nanocubes-discuss mailing list
> [hidden email]
> http://mailman.nanocubes.net/mailman/listinfo/nanocubes-discuss_mailman.nanocubes.net
>
>
>
>
Reply | Threaded
Open this post in threaded view
|  
Report Content as Inappropriate

Re: [Nanocubes-discuss] cannot build on ubuntu 12.04

Song Li
In reply to this post by laurolins
I'm using 1.48.0.2



On Wed, Jan 8, 2014 at 1:16 PM, Lauro Lins <[hidden email]> wrote:
Hi Song,
Maybe this problem can be solved by using a newer version of boost. What boost version you have?
Thanks,
Lauro

On Jan 8, 2014, at 5:28 PM, Song Li <[hidden email]> wrote:

Hi there,

I am trying to build nanocube but got stuck, here're the details:

System configuration:
OS:  Ubuntu 64bit

uname -a 
Linux song-VirtualBox 3.8.0-29-generic #42~precise1-Ubuntu SMP Wed Aug 14 16:19:23 UTC 2013 x86_64 x86_64 x86_64 GNU/Linux

Tool chain:

GCC: gcc version 4.7.3 (Ubuntu/Linaro 4.7.3-2ubuntu1~12.04) 
G++: g++-4.7

I followed the steps in:


and was able to get to make, no errors during config, however I got the following errors:

In file included from /usr/include/boost/thread/pthread/condition_variable.hpp:10:0,
                 from /usr/include/boost/thread/condition_variable.hpp:16,
                 from /usr/include/boost/thread/pthread/shared_mutex.hpp:13,
                 from /usr/include/boost/thread/shared_mutex.hpp:16,
                 from nc.cc:25:
/usr/include/boost/thread/pthread/thread_data.hpp: In constructor ‘boost::detail::tss_data_node::tss_data_node(boost::shared_ptr<boost::detail::tss_cleanup_function>, void*)’:
/usr/include/boost/thread/pthread/thread_data.hpp:36:41: error: use of deleted function ‘boost::shared_ptr<boost::detail::tss_cleanup_function>::shared_ptr(const boost::shared_ptr<boost::detail::tss_cleanup_function>&)’
In file included from /usr/include/boost/shared_ptr.hpp:17:0,
                 from /usr/include/boost/spirit/home/qi/string/symbols.hpp:30,
                 from /usr/include/boost/spirit/home/qi/string.hpp:15,
                 from /usr/include/boost/spirit/home/qi.hpp:27,
                 from /usr/include/boost/spirit/include/qi.hpp:16,
                 from ./QueryParser.hh:11,
                 from nc.cc:13:
/usr/include/boost/smart_ptr/shared_ptr.hpp:168:25: note: ‘boost::shared_ptr<boost::detail::tss_cleanup_function>::shared_ptr(const boost::shared_ptr<boost::detail::tss_cleanup_function>&)’ is implicitly declared as deleted because ‘boost::shared_ptr<boost::detail::tss_cleanup_function>’ declares a move constructor or move assignment operator
make[2]: *** [nc_q20_q20_u2_u4-nc.o] Error 1


--
Best Regards,

Song

This message (including any attachments) contains confidential information intended for a specific individual and purpose, and is protected by law.  If you are not the intended recipient, you should delete this message.  Any disclosure, copying, or distribution of this message, or the taking of any action based on it, is strictly prohibited.
_______________________________________________
Nanocubes-discuss mailing list
[hidden email]
http://mailman.nanocubes.net/mailman/listinfo/nanocubes-discuss_mailman.nanocubes.net


_______________________________________________
Nanocubes-discuss mailing list
[hidden email]
http://mailman.nanocubes.net/mailman/listinfo/nanocubes-discuss_mailman.nanocubes.net




--
Best Regards,

Song

This message (including any attachments) contains confidential information intended for a specific individual and purpose, and is protected by law.  If you are not the intended recipient, you should delete this message.  Any disclosure, copying, or distribution of this message, or the taking of any action based on it, is strictly prohibited.
Reply | Threaded
Open this post in threaded view
|  
Report Content as Inappropriate

Re: [Nanocubes-discuss] cannot build on ubuntu 12.04

laurolins
Hi Song,
I think the oldest boost version I got nanocube to run with was 1.49. Can you try to upgrade 
your boost version and give it a shot? I am currently using boost 1.55 in my system.

Thanks,
Lauro


On Jan 8, 2014, at 6:20 PM, Song Li <[hidden email]> wrote:

I'm using 1.48.0.2



On Wed, Jan 8, 2014 at 1:16 PM, Lauro Lins <[hidden email]> wrote:
Hi Song,
Maybe this problem can be solved by using a newer version of boost. What boost version you have?
Thanks,
Lauro

On Jan 8, 2014, at 5:28 PM, Song Li <[hidden email]> wrote:

Hi there,

I am trying to build nanocube but got stuck, here're the details:

System configuration:
OS:  Ubuntu 64bit

uname -a 
Linux song-VirtualBox 3.8.0-29-generic #42~precise1-Ubuntu SMP Wed Aug 14 16:19:23 UTC 2013 x86_64 x86_64 x86_64 GNU/Linux

Tool chain:

GCC: gcc version 4.7.3 (Ubuntu/Linaro 4.7.3-2ubuntu1~12.04) 
G++: g++-4.7

I followed the steps in:


and was able to get to make, no errors during config, however I got the following errors:

In file included from /usr/include/boost/thread/pthread/condition_variable.hpp:10:0,
                 from /usr/include/boost/thread/condition_variable.hpp:16,
                 from /usr/include/boost/thread/pthread/shared_mutex.hpp:13,
                 from /usr/include/boost/thread/shared_mutex.hpp:16,
                 from nc.cc:25:
/usr/include/boost/thread/pthread/thread_data.hpp: In constructor ‘boost::detail::tss_data_node::tss_data_node(boost::shared_ptr<boost::detail::tss_cleanup_function>, void*)’:
/usr/include/boost/thread/pthread/thread_data.hpp:36:41: error: use of deleted function ‘boost::shared_ptr<boost::detail::tss_cleanup_function>::shared_ptr(const boost::shared_ptr<boost::detail::tss_cleanup_function>&)’
In file included from /usr/include/boost/shared_ptr.hpp:17:0,
                 from /usr/include/boost/spirit/home/qi/string/symbols.hpp:30,
                 from /usr/include/boost/spirit/home/qi/string.hpp:15,
                 from /usr/include/boost/spirit/home/qi.hpp:27,
                 from /usr/include/boost/spirit/include/qi.hpp:16,
                 from ./QueryParser.hh:11,
                 from nc.cc:13:
/usr/include/boost/smart_ptr/shared_ptr.hpp:168:25: note: ‘boost::shared_ptr<boost::detail::tss_cleanup_function>::shared_ptr(const boost::shared_ptr<boost::detail::tss_cleanup_function>&)’ is implicitly declared as deleted because ‘boost::shared_ptr<boost::detail::tss_cleanup_function>’ declares a move constructor or move assignment operator
make[2]: *** [nc_q20_q20_u2_u4-nc.o] Error 1


--
Best Regards,

Song

This message (including any attachments) contains confidential information intended for a specific individual and purpose, and is protected by law.  If you are not the intended recipient, you should delete this message.  Any disclosure, copying, or distribution of this message, or the taking of any action based on it, is strictly prohibited.
_______________________________________________
Nanocubes-discuss mailing list
[hidden email]
http://mailman.nanocubes.net/mailman/listinfo/nanocubes-discuss_mailman.nanocubes.net


_______________________________________________
Nanocubes-discuss mailing list
[hidden email]
http://mailman.nanocubes.net/mailman/listinfo/nanocubes-discuss_mailman.nanocubes.net




--
Best Regards,

Song

This message (including any attachments) contains confidential information intended for a specific individual and purpose, and is protected by law.  If you are not the intended recipient, you should delete this message.  Any disclosure, copying, or distribution of this message, or the taking of any action based on it, is strictly prohibited.
_______________________________________________
Nanocubes-discuss mailing list
[hidden email]
http://mailman.nanocubes.net/mailman/listinfo/nanocubes-discuss_mailman.nanocubes.net

Reply | Threaded
Open this post in threaded view
|  
Report Content as Inappropriate

Re: [Nanocubes-discuss] cannot build on ubuntu 12.04

Song Li
Hi Lauro,

Thanks for getting back to me. I think 1.48.0.2 is my libboost-dev's version, and it is the latest for Ubuntu 12.04 according to apt-get. So I'm guessing I should be installing a different apt. Which apt are you using to get the latest boost?

thanks,

Song


On Wed, Jan 8, 2014 at 1:22 PM, Lauro Lins <[hidden email]> wrote:
Hi Song,
I think the oldest boost version I got nanocube to run with was 1.49. Can you try to upgrade 
your boost version and give it a shot? I am currently using boost 1.55 in my system.

Thanks,
Lauro


On Jan 8, 2014, at 6:20 PM, Song Li <[hidden email]> wrote:

I'm using 1.48.0.2



On Wed, Jan 8, 2014 at 1:16 PM, Lauro Lins <[hidden email]> wrote:
Hi Song,
Maybe this problem can be solved by using a newer version of boost. What boost version you have?
Thanks,
Lauro

On Jan 8, 2014, at 5:28 PM, Song Li <[hidden email]> wrote:

Hi there,

I am trying to build nanocube but got stuck, here're the details:

System configuration:
OS:  Ubuntu 64bit

uname -a 
Linux song-VirtualBox 3.8.0-29-generic #42~precise1-Ubuntu SMP Wed Aug 14 16:19:23 UTC 2013 x86_64 x86_64 x86_64 GNU/Linux

Tool chain:

GCC: gcc version 4.7.3 (Ubuntu/Linaro 4.7.3-2ubuntu1~12.04) 
G++: g++-4.7

I followed the steps in:


and was able to get to make, no errors during config, however I got the following errors:

In file included from /usr/include/boost/thread/pthread/condition_variable.hpp:10:0,
                 from /usr/include/boost/thread/condition_variable.hpp:16,
                 from /usr/include/boost/thread/pthread/shared_mutex.hpp:13,
                 from /usr/include/boost/thread/shared_mutex.hpp:16,
                 from nc.cc:25:
/usr/include/boost/thread/pthread/thread_data.hpp: In constructor ‘boost::detail::tss_data_node::tss_data_node(boost::shared_ptr<boost::detail::tss_cleanup_function>, void*)’:
/usr/include/boost/thread/pthread/thread_data.hpp:36:41: error: use of deleted function ‘boost::shared_ptr<boost::detail::tss_cleanup_function>::shared_ptr(const boost::shared_ptr<boost::detail::tss_cleanup_function>&)’
In file included from /usr/include/boost/shared_ptr.hpp:17:0,
                 from /usr/include/boost/spirit/home/qi/string/symbols.hpp:30,
                 from /usr/include/boost/spirit/home/qi/string.hpp:15,
                 from /usr/include/boost/spirit/home/qi.hpp:27,
                 from /usr/include/boost/spirit/include/qi.hpp:16,
                 from ./QueryParser.hh:11,
                 from nc.cc:13:
/usr/include/boost/smart_ptr/shared_ptr.hpp:168:25: note: ‘boost::shared_ptr<boost::detail::tss_cleanup_function>::shared_ptr(const boost::shared_ptr<boost::detail::tss_cleanup_function>&)’ is implicitly declared as deleted because ‘boost::shared_ptr<boost::detail::tss_cleanup_function>’ declares a move constructor or move assignment operator
make[2]: *** [nc_q20_q20_u2_u4-nc.o] Error 1


--
Best Regards,

Song

This message (including any attachments) contains confidential information intended for a specific individual and purpose, and is protected by law.  If you are not the intended recipient, you should delete this message.  Any disclosure, copying, or distribution of this message, or the taking of any action based on it, is strictly prohibited.
_______________________________________________
Nanocubes-discuss mailing list
[hidden email]
http://mailman.nanocubes.net/mailman/listinfo/nanocubes-discuss_mailman.nanocubes.net


_______________________________________________
Nanocubes-discuss mailing list
[hidden email]
http://mailman.nanocubes.net/mailman/listinfo/nanocubes-discuss_mailman.nanocubes.net




--
Best Regards,

Song

This message (including any attachments) contains confidential information intended for a specific individual and purpose, and is protected by law.  If you are not the intended recipient, you should delete this message.  Any disclosure, copying, or distribution of this message, or the taking of any action based on it, is strictly prohibited.
_______________________________________________
Nanocubes-discuss mailing list
[hidden email]
http://mailman.nanocubes.net/mailman/listinfo/nanocubes-discuss_mailman.nanocubes.net


_______________________________________________
Nanocubes-discuss mailing list
[hidden email]
http://mailman.nanocubes.net/mailman/listinfo/nanocubes-discuss_mailman.nanocubes.net




--
Best Regards,

Song

This message (including any attachments) contains confidential information intended for a specific individual and purpose, and is protected by law.  If you are not the intended recipient, you should delete this message.  Any disclosure, copying, or distribution of this message, or the taking of any action based on it, is strictly prohibited.
Reply | Threaded
Open this post in threaded view
|  
Report Content as Inappropriate

Re: [Nanocubes-discuss] cannot build on ubuntu 12.04

Song Li
In reply to this post by Stephen Frowe Ingram
Thanks Guys! After upgrading boost I was able to build.


On Wed, Jan 8, 2014 at 1:19 PM, Stephen Frowe Ingram <[hidden email]> wrote:

Seconded.  I had this same error which was fixed by updating to the latest boost.

I used the boost install from the website and not the one from 'apt-get'.

-Stephen

On Wed, 8 Jan 2014, Lauro Lins wrote:

Hi Song,Maybe this problem can be solved by using a newer version of boost. What boost version you have?

Thanks,
Lauro

On Jan 8, 2014, at 5:28 PM, Song Li <[hidden email]> wrote:

      Hi there,
I am trying to build nanocube but got stuck, here're the details:

System configuration:
OS:  Ubuntu 64bit

uname -a  Linux song-VirtualBox 3.8.0-29-generic #42~precise1-Ubuntu SMP Wed Aug 14 16:19:23 UTC 2013 x86_64 x86_64 x86_64 GNU/Linux

Tool chain:

GCC: gcc version 4.7.3 (Ubuntu/Linaro 4.7.3-2ubuntu1~12.04) 
G++: g++-4.7

I followed the steps in:

https://github.com/laurolins/nanocube/blob/master/README.md

and was able to get to make, no errors during config, however I got the following errors:

In file included from /usr/include/boost/thread/pthread/condition_variable.hpp:10:0,
                 from /usr/include/boost/thread/condition_variable.hpp:16,
                 from /usr/include/boost/thread/pthread/shared_mutex.hpp:13,
                 from /usr/include/boost/thread/shared_mutex.hpp:16,
                 from nc.cc:25:
/usr/include/boost/thread/pthread/thread_data.hpp: In constructor ‘boost::detail::tss_data_node::tss_data_node(boost::shared_ptr<boost::detail::tss_cleanup_function>, void*)’:
/usr/include/boost/thread/pthread/thread_data.hpp:36:41: error: use of deleted function ‘boost::shared_ptr<boost::detail::tss_cleanup_function>::shared_ptr(const boost::shared_ptr<boost::detail::tss_cleanup_function>&)’
In file included from /usr/include/boost/shared_ptr.hpp:17:0,
                 from /usr/include/boost/spirit/home/qi/string/symbols.hpp:30,
                 from /usr/include/boost/spirit/home/qi/string.hpp:15,
                 from /usr/include/boost/spirit/home/qi.hpp:27,
                 from /usr/include/boost/spirit/include/qi.hpp:16,
                 from ./QueryParser.hh:11,
                 from nc.cc:13:
/usr/include/boost/smart_ptr/shared_ptr.hpp:168:25: note: ‘boost::shared_ptr<boost::detail::tss_cleanup_function>::shared_ptr(const boost::shared_ptr<boost::detail::tss_cleanup_function>&)’ is implicitly declared as deleted because
‘boost::shared_ptr<boost::detail::tss_cleanup_function>’ declares a move constructor or move assignment operator
make[2]: *** [nc_q20_q20_u2_u4-nc.o] Error 1


--
Best Regards,

Song

This message (including any attachments) contains confidential information intended for a specific individual and purpose, and is protected by law.  If you are not the intended recipient, you should delete this message.  Any disclosure, copying, or
distribution of this message, or the taking of any action based on it, is strictly prohibited.
_______________________________________________
Nanocubes-discuss mailing list
[hidden email]
http://mailman.nanocubes.net/mailman/listinfo/nanocubes-discuss_mailman.nanocubes.net




_______________________________________________
Nanocubes-discuss mailing list
[hidden email]
http://mailman.nanocubes.net/mailman/listinfo/nanocubes-discuss_mailman.nanocubes.net




--
Best Regards,

Song

This message (including any attachments) contains confidential information intended for a specific individual and purpose, and is protected by law.  If you are not the intended recipient, you should delete this message.  Any disclosure, copying, or distribution of this message, or the taking of any action based on it, is strictly prohibited.
Loading...