Quantcast

[Nanocubes-discuss] nanocubes: make build error on CentOS in VMware

classic Classic list List threaded Threaded
2 messages Options
Reply | Threaded
Open this post in threaded view
|  
Report Content as Inappropriate

[Nanocubes-discuss] nanocubes: make build error on CentOS in VMware

Mark Webley
Hi Guys

Am trying to set up this nanocubes project according to the build section on:

I have this moongoose server running....
I run make inside the moongoose directory and 
I get lots of errors in the console like:
error: expected initializer before ':' token
error: expected primary-expression before '}' token

ncdmp.cc:220: error: 'struct' dumpfile::DumpFileDescription' has no member named 'encoding'
ncdmp.cc:222: error: 'struct' dumpfile::DumpFileDescription' has no member named 'encoding'
make[2]: ***[ncdmp.o] Error 1
make[2]: Leaving directory 'path/to/folder/nanocube/src'
make[2]: ***[all-recursive] Error 1
make[2]: Leaving directory 'path/to/folder/nanocube/'
make: ***[all] Error 2

any ideas what am I missing, am I missing a library....?

I downloaded mongoose for centOS here:

I did not see on in the nanocubes proeject I pulled from Github above.

Anyy ideas how do I get this nanocube running....


Reply | Threaded
Open this post in threaded view
|  
Report Content as Inappropriate

Re: [Nanocubes-discuss] nanocubes: make build error on CentOS in VMware

laurolins
Hi Mark,

The mongoose dependency is included in the nanocube source tree, so you don’t need to download or run mongoose to build nanocube. Does your compiler support C++11? Do you have a recent copy of the boost library available (v1.5x.0) ? What are the first errors you get when compiling?

Thanks,
Lauro

On Jan 14, 2014, at 10:27 AM, Mark Webley <[hidden email]> wrote:

Hi Guys

Am trying to set up this nanocubes project according to the build section on:

I have this moongoose server running....
I run make inside the moongoose directory and 
I get lots of errors in the console like:
error: expected initializer before ':' token
error: expected primary-expression before '}' token

ncdmp.cc:220: error: 'struct' dumpfile::DumpFileDescription' has no member named 'encoding'
ncdmp.cc:222: error: 'struct' dumpfile::DumpFileDescription' has no member named 'encoding'
make[2]: ***[ncdmp.o] Error 1
make[2]: Leaving directory 'path/to/folder/nanocube/src'
make[2]: ***[all-recursive] Error 1
make[2]: Leaving directory 'path/to/folder/nanocube/'
make: ***[all] Error 2

any ideas what am I missing, am I missing a library....?

I downloaded mongoose for centOS here:

I did not see on in the nanocubes proeject I pulled from Github above.

Anyy ideas how do I get this nanocube running....


_______________________________________________
Nanocubes-discuss mailing list
[hidden email]
http://mailman.nanocubes.net/mailman/listinfo/nanocubes-discuss_mailman.nanocubes.net

Loading...